Target
5-hydroxytryptamine receptor 2A
Ligand
BDBM50052338
Substrate
Meas. Tech.
ChEMBL_2634 (CHEMBL621546)
Ki
2300±n/a nM
Citation
 Monte, APMarona-Lewicka, DParker, MAWainscott, DBNelson, DLNichols, DE Dihydrobenzofuran analogues of hallucinogens. 3. Models of 4-substituted (2,5-dimethoxyphenyl)alkylamine derivatives with rigidified methoxy groups. J Med Chem 39:2953-61 (1996)  
Target
Name:
5-hydroxytryptamine receptor 2A
Synonyms:
5-HT-2A 5-HT2A 5-hydroxytryptamine receptor 2A (5HT2A) Htr2 Serotonin Receptor 2A
Type:
G Protein-Coupled Receptor (GPCR)
Mol. Mass.:
52852.05
Organism:
Rattus norvegicus (rat)
Description:
Rat cortex membranes 5-HT2A receptors.
Residue:
471
  
Inhibitor
Name:
BDBM50052338
Synonyms:
2-(2,3,6,7-Tetrahydro-benzo[1,2-b;4,5-b']difuran-4-yl)-ethylamine | CHEMBL100626
Type:
Small organic molecule
Emp. Form.:
C12H15NO2
Mol. Mass.:
205.253
SMILES:
NCCc1c2CCOc2cc2CCOc12
: