Target
5-hydroxytryptamine receptor 2A
Ligand
BDBM50005257
Substrate
Meas. Tech.
ChEMBL_2634 (CHEMBL621546)
Ki
22±n/a nM
Citation
 Monte, APMarona-Lewicka, DParker, MAWainscott, DBNelson, DLNichols, DE Dihydrobenzofuran analogues of hallucinogens. 3. Models of 4-substituted (2,5-dimethoxyphenyl)alkylamine derivatives with rigidified methoxy groups. J Med Chem 39:2953-61 (1996)  
Target
Name:
5-hydroxytryptamine receptor 2A
Synonyms:
5-HT-2A 5-HT2A 5-hydroxytryptamine receptor 2A (5HT2A) Htr2 Serotonin Receptor 2A
Type:
G Protein-Coupled Receptor (GPCR)
Mol. Mass.:
52852.05
Organism:
Rattus norvegicus (rat)
Description:
Rat cortex membranes 5-HT2A receptors.
Residue:
471
  
Inhibitor
Name:
BDBM50005257
Synonyms:
(+)-2-(4-Bromo-2,5-dimethoxy-phenyl)-1-methyl-ethylamine (+/-)2-(4-Bromo-2,5-dimethoxy-phenyl)-1-methyl-ethylamine (-)2-(4-Bromo-2,5-dimethoxy-phenyl)-1-methyl-ethylamine 2-(2-Methoxy-phenyl)-1-methyl-ethylamine 2-(4-Bromo-2,5-dimethoxy-phenyl)-1-methyl-ethylamine((-)-DOB) 2-(4-Bromo-2,5-dimethoxy-phenyl)-1-methyl-ethylamine((S)-(+)-DOB) 2-(4-Bromo-2,5-dimethoxy-phenyl)-1-methyl-ethylamine[R(-)DOB] Brolamfetamine DOB | Racemic DOB
Type:
Small organic molecule
Emp. Form.:
C11H16BrNO2
Mol. Mass.:
274.154
SMILES:
COc1cc(CC(C)N)c(OC)cc1Br
: