Target
Neuromedin-K receptor
Ligand
BDBM50052518
Substrate
Meas. Tech.
ChEMBL_209699 (CHEMBL811685)
EC50
>10000±n/a nM
Citation
 Byk, GHalle, DZeltser, IBitan, GSelinger, ZGilon, C Synthesis and biological activity of NK-1 selective, N-backbone cyclic analogs of the C-terminal hexapeptide of substance P. J Med Chem 39:3174-8 (1996)  
Target
Name:
Neuromedin-K receptor
Synonyms:
NK3R_RAT Tac3r | Tacr3
Type:
Mol. Mass.:
51128.60
Organism:
Rattus norvegicus
Description:
ChEMBL_10983
Residue:
452
  
Inhibitor
Name:
BDBM50052518
Synonyms:
(S)-2-{2-[(6S,9R,12S)-6,9-Dibenzyl-12-(3-guanidino-propyl)-5,8,11,14,17-pentaoxo-1,4,7,10,13pentaaza-cycloheptadec-4-yl]-acetylamino}-4-methyl-pentanoic acid ((S)-1-carbamoyl-3-methylsulfanyl-propyl)-amide | CHEMBL419558
Type:
Small organic molecule
Emp. Form.:
C43H63N11O8S
Mol. Mass.:
894.094
SMILES:
CSCC[C@H](NC(=O)[C@H](CC(C)C)NC(=O)CN1CCNC(=O)CCC(=O)N[C@@H](CCCNC(N)=N)C(=O)N[C@H](Cc2ccccc2)C(=O)N[C@@H](Cc2ccccc2)C1=O)C(N)=O
: