Target
Substance-P receptor
Ligand
BDBM50052518
Substrate
Meas. Tech.
ChEMBL_205396 (CHEMBL817413)
EC50
4000±n/a nM
Citation
 Byk, GHalle, DZeltser, IBitan, GSelinger, ZGilon, C Synthesis and biological activity of NK-1 selective, N-backbone cyclic analogs of the C-terminal hexapeptide of substance P. J Med Chem 39:3174-8 (1996)  
Target
Name:
Substance-P receptor
Synonyms:
NK1R_CAVPO Neurokinin NK1 TACR1
Type:
Enzyme Catalytic Domain
Mol. Mass.:
46261.42
Organism:
GUINEA PIG
Description:
Neurokinin NK1 TACR1 GUINEA PIG::P30547
Residue:
407
  
Inhibitor
Name:
BDBM50052518
Synonyms:
(S)-2-{2-[(6S,9R,12S)-6,9-Dibenzyl-12-(3-guanidino-propyl)-5,8,11,14,17-pentaoxo-1,4,7,10,13pentaaza-cycloheptadec-4-yl]-acetylamino}-4-methyl-pentanoic acid ((S)-1-carbamoyl-3-methylsulfanyl-propyl)-amide | CHEMBL419558
Type:
Small organic molecule
Emp. Form.:
C43H63N11O8S
Mol. Mass.:
894.094
SMILES:
CSCC[C@H](NC(=O)[C@H](CC(C)C)NC(=O)CN1CCNC(=O)CCC(=O)N[C@@H](CCCNC(N)=N)C(=O)N[C@H](Cc2ccccc2)C(=O)N[C@@H](Cc2ccccc2)C1=O)C(N)=O
: