Target
Neuromedin-K receptor
Ligand
BDBM50052521
Substrate
Meas. Tech.
ChEMBL_209699 (CHEMBL811685)
EC50
2000±n/a nM
Citation
 Byk, GHalle, DZeltser, IBitan, GSelinger, ZGilon, C Synthesis and biological activity of NK-1 selective, N-backbone cyclic analogs of the C-terminal hexapeptide of substance P. J Med Chem 39:3174-8 (1996)  
Target
Name:
Neuromedin-K receptor
Synonyms:
NK3R_RAT Tac3r | Tacr3
Type:
Mol. Mass.:
51128.60
Organism:
Rattus norvegicus
Description:
ChEMBL_10983
Residue:
452
  
Inhibitor
Name:
BDBM50052521
Synonyms:
(S)-2-{2-[{(S)-2-[(S)-2-((S)-2-Acetylamino-5-guanidino-pentanoylamino)-3-phenyl-propionylamino]-3-phenyl-propionyl}-(3-amino-propyl)-amino]-acetylamino}-4-methyl-pentanoic acid ((S)-1-carbamoyl-3-methylsulfanyl-propyl)-amide | CHEMBL106184
Type:
Small organic molecule
Emp. Form.:
C42H65N11O7S
Mol. Mass.:
868.1
SMILES:
CSCC[C@H](NC(=O)[C@H](CC(C)C)NC(=O)CN(CCCN)C(=O)[C@H](Cc1ccccc1)NC(=O)[C@H](Cc1ccccc1)NC(=O)[C@H](CCCNC(N)=N)NC(C)=O)C(N)=O
: