Target
Substance-K receptor
Ligand
BDBM50052516
Substrate
Meas. Tech.
ChEMBL_209225 (CHEMBL814853)
EC50
>50000±n/a nM
Citation
 Byk, GHalle, DZeltser, IBitan, GSelinger, ZGilon, C Synthesis and biological activity of NK-1 selective, N-backbone cyclic analogs of the C-terminal hexapeptide of substance P. J Med Chem 39:3174-8 (1996)  
Target
Name:
Substance-K receptor
Synonyms:
NK-2 receptor NK2R_RAT Neurokinin A receptor SKR Tac2r Tacr2
Type:
Enzyme Catalytic Domain
Mol. Mass.:
43868.63
Organism:
Rattus norvegicus (Rat)
Description:
Neurokinin NK2 TACR2 Murine::P16610
Residue:
390
  
Inhibitor
Name:
BDBM50052516
Synonyms:
(S)-2-{2-[(3S,6R,9S)-3,6-Dibenzyl-9-(3-guanidino-propyl)-2,5,8,11,15-pentaoxo-1,4,7,10,16pentaaza-cyclodocos-1-yl]-acetylamino}-4-methyl-pentanoic acid ((S)-1-carbamoyl-3-methylsulfanyl-propyl)-amide | CHEMBL431243
Type:
Small organic molecule
Emp. Form.:
C48H73N11O8S
Mol. Mass.:
964.227
SMILES:
CSCC[C@H](NC(=O)[C@H](CC(C)C)NC(=O)CN1CCCCCCNC(=O)CCCC(=O)N[C@@H](CCCNC(N)=N)C(=O)N[C@H](Cc2ccccc2)C(=O)N[C@@H](Cc2ccccc2)C1=O)C(N)=O
: