Target
D(2) dopamine receptor
Ligand
BDBM50002173
Substrate
Meas. Tech.
ChEMBL_62559 (CHEMBL671490)
Ki
9.1±n/a nM
Citation
 Glase, SAAkunne, HCHeffner, TGJaen, JCMacKenzie, RGMeltzer, LTPugsley, TASmith, SJWise, LD Aryl 1-but-3-ynyl-4-phenyl-1,2,3,6-tetrahydropyridines as potential antipsychotic agents: synthesis and structure-activity relationships. J Med Chem 39:3179-87 (1996)  
Target
Name:
D(2) dopamine receptor
Synonyms:
DOPAMINE D2 DOPAMINE D2 Short Dopamine D2 receptor Drd2
Type:
G Protein-Coupled Receptor (GPCR)
Mol. Mass.:
50931.60
Organism:
Rattus norvegicus (rat)
Description:
P61169
Residue:
444
  
Inhibitor
Name:
BDBM50002173
Synonyms:
3-(4-(3,6-dihydro-4-phenyl-1(2H)-pyridinyl)butyl)-1H-indol-5-ol 3-[4-(4-phenyl-3,6-dihydropyridin-1(2H)-yl)butyl]-1H-indol-5-ol roxindole
Type:
Small organic molecule
Emp. Form.:
C23H26N2O
Mol. Mass.:
346.4653
SMILES:
Oc1ccc2[nH]cc(CCCCN3CCC(=CC3)c3ccccc3)c2c1
: