Target
D(1A) dopamine receptor
Ligand
BDBM50029340
Substrate
Meas. Tech.
ChEMBL_58508 (CHEMBL672003)
Ki
49±n/a nM
Citation
 Shah, JHKline, RHGeter-Douglass, BIzenwasser, SWitkin, JMNewman, AH (+/-)-3-[4'-(N,N-dimethylamino)cinnamyl]benzazepine analogs: novel dopamine D1 receptor antagonists. J Med Chem 39:3423-8 (1996)  
Target
Name:
D(1A) dopamine receptor
Synonyms:
DOPAMINE D1 Dopamine D1 high Dopamine receptor Dopamine1-like Drd1a
Type:
Enzyme Catalytic Domain
Mol. Mass.:
49429.75
Organism:
RAT
Description:
P18901
Residue:
446
  
Inhibitor
Name:
BDBM50029340
Synonyms:
8-Chloro-3-(6-dimethylamino-hexyl)-5-phenyl-2,3,4,5-tetrahydro-1H-benzo[d]azepin-7-ol | CHEMBL108764
Type:
Small organic molecule
Emp. Form.:
C24H33ClN2O
Mol. Mass.:
400.985
SMILES:
CN(C)CCCCCCN1CCc2cc(Cl)c(O)cc2C(C1)c1ccccc1
: