Target
D(2) dopamine receptor
Ligand
BDBM84636
Substrate
Meas. Tech.
ChEMBL_61453 (CHEMBL670880)
Ki
12.7±n/a nM
Citation
 Hedberg, MHLinnanen, TJansen, JMNordvall, GHjorth, SUnelius, LJohansson, AM 11-substituted (R)-aporphines: synthesis, pharmacology, and modeling of D2A and 5-HT1A receptor interactions. J Med Chem 39:3503-13 (1996)  
Target
Name:
D(2) dopamine receptor
Synonyms:
D(2) dopamine receptor DOPAMINE D2 Long DRD2 Dopamine D2 receptor Dopamine D2 receptor (D2R) Dopamine2-like | d2
Type:
Cell-surface receptors
Mol. Mass.:
50647.10
Organism:
Homo sapiens (Human)
Description:
P14416
Residue:
443
  
Inhibitor
Name:
BDBM84636
Synonyms:
CHEMBL27559 | NPA-11-OH-R,(+)
Type:
Small organic molecule
Emp. Form.:
C19H21NO
Mol. Mass.:
279.3761
SMILES:
CCCN1CCc2cccc-3c2[C@H]1Cc1cccc(O)c-31
: