Target
Alpha-2B adrenergic receptor
Ligand
BDBM50021812
Substrate
Meas. Tech.
ChEMBL_33502 (CHEMBL873180)
Ki
4.8±n/a nM
Citation
 Munk, SAHarcourt, DAmbrus, GDenys, LGluchowski, CBurke, JAKharlamb, ABManlapaz, CAPadillo, EURunde, EWilliams, LWheeler, LAGarst, ME Synthesis and evaluation of 2-[(5-methylbenz-1-ox-4-azin-6-yl)imino]imidazoline, a potent, peripherally acting alpha 2 adrenoceptor agonist. J Med Chem 39:3533-8 (1996)  
Target
Name:
Alpha-2B adrenergic receptor
Synonyms:
ADA2B_RAT Adrenergic receptor alpha Alpha-2B adrenergic receptor Alpha-2B adrenoreceptor | adrenergic Alpha2B
Type:
Enzyme Catalytic Domain
Mol. Mass.:
50379.83
Organism:
NEONATAL RAT
Description:
adrenergic Alpha2B ADRA2B NEONATAL RAT::P19328
Residue:
453
  
Inhibitor
Name:
BDBM50021812
Synonyms:
2,6-Dichloro-N-imidazolidin-2-ylidene-benzene-1,4-diamine 2,6-Dichloro-N-imidazolidin-2-ylidene-benzene-1,4-diamine(p-Aminoclonidine) CHEMBL647 | P-AMINOCLONIDINE2,6-Dichloro-N-imidazolidin-2-ylidene-benzene-1,4-diamine
Type:
Small organic molecule
Emp. Form.:
C9H10Cl2N4
Mol. Mass.:
245.109
SMILES:
[#7]-c1cc(Cl)c(\[#7]=[#6]-2\[#7]-[#6]-[#6]-[#7]-2)c(Cl)c1
: