Target
Retinoic acid receptor alpha
Ligand
BDBM31883
Substrate
Meas. Tech.
ChEMBL_195187 (CHEMBL802720)
Kd
15±n/a nM
Citation
 Beard, RLColon, DFSong, TKDavies, PJKochhar, DMChandraratna, RA Synthesis and structure-activity relationships of retinoid X receptor selective diaryl sulfide analogs of retinoic acid. J Med Chem 39:3556-63 (1996)  
Target
Name:
Retinoic acid receptor alpha
Synonyms:
Nr1b1 Rara
Type:
PROTEIN
Mol. Mass.:
50742.79
Organism:
Mus musculus
Description:
ChEMBL_195182
Residue:
462
  
Inhibitor
Name:
BDBM31883
Synonyms:
9-cis-retinoic acid (9cRA) AT-RA CHEMBL38 SMR000058245 Vitamin A acid [3H]Retinoic acid [3H]tretinoin cid_444795
Type:
radiolabeled ligand
Emp. Form.:
C20H28O2
Mol. Mass.:
300.4351
SMILES:
C\C(\C=C\C1=C(C)CCCC1(C)C)=C/C=C/C(/C)=C/C(O)=O
: