Target
Alpha-1A adrenergic receptor
Ligand
BDBM50001782
Substrate
Meas. Tech.
ChEMBL_33158 (CHEMBL642943)
IC50
70±n/a nM
Citation
 Andersen, KLiljefors, THyttel, JPerregaard, J Serotonin 5-HT2 receptor, dopamine D2 receptor, and alpha 1 adrenoceptor antagonists. Conformationally flexible analogues of the atypical antipsychotic sertindole. J Med Chem 39:3723-38 (1996)  
Target
Name:
Alpha-1A adrenergic receptor
Synonyms:
ADA1A_RAT Adra1c Alpha-1A adrenoceptor Alpha-1C adrenergic receptor | adrenergic Alpha1A
Type:
Protein
Mol. Mass.:
51620.15
Organism:
Rattus norvegicus (Rat)
Description:
P43140
Residue:
466
  
Inhibitor
Name:
BDBM50001782
Synonyms:
(Lu 26-042)1-(2-{4-[6-Chloro-1-(4-fluoro-phenyl)-1H-indol-3-yl]-piperidin-1-yl}-ethyl)-3-isopropyl-imidazolidin-2-one CHEMBL331545
Type:
Small organic molecule
Emp. Form.:
C27H32ClFN4O
Mol. Mass.:
483.021
SMILES:
CC(C)N1CCN(CCN2CCC(CC2)c2cn(-c3ccc(F)cc3)c3cc(Cl)ccc23)C1=O
: