Target
Leukotriene B4 receptor 1
Ligand
BDBM50053355
Substrate
Meas. Tech.
ChEMBL_99831 (CHEMBL709861)
Ki
1.5±n/a nM
Citation
 Daines, RAChambers, PAFoley, JJGriswold, DEKingsbury, WDMartin, LDSchmidt, DBSham, KKSarau, HM (E)-3-[6-[[(2,6-dichlorophenyl)thio]methyl]-3-(2-phenylethoxy)-2- pyridinyl]-2-propenoic acid: a high-affinity leukotriene B4 receptor antagonist with oral antiinflammatory activity. J Med Chem 39:3837-41 (1996)  
Target
Name:
Leukotriene B4 receptor 1
Synonyms:
BLT BLTR Chemoattractant receptor-like 1 GPR16 LTB4-R 1 Leukotriene B4 R1 Leukotriene B4 receptor 1 P2Y purinoceptor 7 | P2Y7
Type:
Enzyme Catalytic Domain
Mol. Mass.:
37582.68
Organism:
Homo sapiens (Human)
Description:
Q15722
Residue:
352
  
Inhibitor
Name:
BDBM50053355
Synonyms:
(E)-3-{6-(2,6-Dichloro-phenylsulfanylmethyl)-3-[2-(4-fluoro-phenyl)-ethoxy]-pyridin-2-yl}-acrylic acid | CHEMBL123722
Type:
Small organic molecule
Emp. Form.:
C23H18Cl2FNO3S
Mol. Mass.:
478.363
SMILES:
OC(=O)\C=C\c1nc(CSc2c(Cl)cccc2Cl)ccc1OCCc1ccc(F)cc1
: