Target
Monoglyceride lipase
Ligand
BDBM50503334
Substrate
Meas. Tech.
ChEMBL_1810393 (CHEMBL4309853)
IC50
17±n/a nM
Citation
 Cisar, JSWeber, ODClapper, JRBlankman, JLHenry, CLSimon, GMAlexander, JPJones, TKEzekowitz, RABO'Neill, GPGrice, CA Identification of ABX-1431, a Selective Inhibitor of Monoacylglycerol Lipase and Clinical Candidate for Treatment of Neurological Disorders. J Med Chem 61:9062-9084 (2018)  
Target
Name:
Monoglyceride lipase
Synonyms:
MAG lipase Mgll Monoglyceride Lipase (MGL)
Type:
Hydrolase
Mol. Mass.:
33391.67
Organism:
Mus musculus (mouse)
Description:
Assays were using membranes of recombinant MAG Lipase transiently transfected in COS-7 cells.
Residue:
303
  
Inhibitor
Name:
BDBM50503334
Synonyms:
CHEMBL4468639
Type:
Small organic molecule
Emp. Form.:
C21H26ClF7N4O2
Mol. Mass.:
534.899
SMILES:
FCCN1CCN(CC1)c1cc(Cl)ccc1CN1CCN(CC1)C(=O)OC(C(F)(F)F)C(F)(F)F
: