Target
Monoglyceride lipase
Ligand
BDBM180035
Substrate
Meas. Tech.
ChEMBL_1810393 (CHEMBL4309853)
IC50
27±n/a nM
Citation
 Cisar, JSWeber, ODClapper, JRBlankman, JLHenry, CLSimon, GMAlexander, JPJones, TKEzekowitz, RABO'Neill, GPGrice, CA Identification of ABX-1431, a Selective Inhibitor of Monoacylglycerol Lipase and Clinical Candidate for Treatment of Neurological Disorders. J Med Chem 61:9062-9084 (2018)  
Target
Name:
Monoglyceride lipase
Synonyms:
MAG lipase Mgll Monoglyceride Lipase (MGL)
Type:
Hydrolase
Mol. Mass.:
33391.67
Organism:
Mus musculus (mouse)
Description:
Assays were using membranes of recombinant MAG Lipase transiently transfected in COS-7 cells.
Residue:
303
  
Inhibitor
Name:
BDBM180035
Synonyms:
US9133148, 9z
Type:
Small organic molecule
Emp. Form.:
C19H22ClF6N3O2
Mol. Mass.:
473.84
SMILES:
FC(F)(F)C(OC(=O)N1CCN(Cc2ccc(Cl)cc2N2CCCC2)CC1)C(F)(F)F
: