Target
Calpain-2 catalytic subunit
Ligand
BDBM50053821
Substrate
Meas. Tech.
ChEMBL_43853 (CHEMBL658514)
Ki
68.0±n/a nM
Citation
 Li, ZOrtega-Vilain, ACPatil, GSChu, DLForeman, JEEveleth, DDPowers, JC Novel peptidyl alpha-keto amide inhibitors of calpains and other cysteine proteases. J Med Chem 39:4089-98 (1996)  
Target
Name:
Calpain-2 catalytic subunit
Synonyms:
CAN2_HUMAN CANPL2 Calcium-activated neutral proteinase 2 Calpain M-type Calpain-2 (m-Calpain) Calpain-2 large subunit M-calpain calpain
Type:
Protein
Mol. Mass.:
79965.18
Organism:
Homo sapiens (Human)
Description:
Residue:
700
  
Inhibitor
Name:
BDBM50053821
Synonyms:
CHEMBL133634 | {1-[1-(3-Imidazol-1-yl-propylaminooxalyl)-propylcarbamoyl]-3-methyl-butyl}-carbamic acid benzyl ester
Type:
Small organic molecule
Emp. Form.:
C25H35N5O5
Mol. Mass.:
485.5759
SMILES:
CCC(NC(=O)C(CC(C)C)NC(=O)OCc1ccccc1)C(=O)C(=O)NCCCn1ccnc1
: