Target
Calpain-2 catalytic subunit
Ligand
BDBM50053863
Substrate
Meas. Tech.
ChEMBL_43853 (CHEMBL658514)
Ki
76.0±n/a nM
Citation
 Li, ZOrtega-Vilain, ACPatil, GSChu, DLForeman, JEEveleth, DDPowers, JC Novel peptidyl alpha-keto amide inhibitors of calpains and other cysteine proteases. J Med Chem 39:4089-98 (1996)  
Target
Name:
Calpain-2 catalytic subunit
Synonyms:
CAN2_HUMAN CANPL2 Calcium-activated neutral proteinase 2 Calpain M-type Calpain-2 (m-Calpain) Calpain-2 large subunit M-calpain calpain
Type:
Protein
Mol. Mass.:
79965.18
Organism:
Homo sapiens (Human)
Description:
Residue:
700
  
Inhibitor
Name:
BDBM50053863
Synonyms:
(3-Methyl-1-{1-[2-(1-methyl-1H-pyrrol-2-yl)-ethylaminooxalyl]-propylcarbamoyl}-butyl)-carbamic acid benzyl ester | CHEMBL132773
Type:
Small organic molecule
Emp. Form.:
C26H36N4O5
Mol. Mass.:
484.5878
SMILES:
CCC(NC(=O)C(CC(C)C)NC(=O)OCc1ccccc1)C(=O)C(=O)NCCc1cccn1C
: