Target
Cathepsin B
Ligand
BDBM50053851
Substrate
Meas. Tech.
ChEMBL_47385 (CHEMBL659000)
Ki
0.094±n/a nM
Citation
 Li, ZOrtega-Vilain, ACPatil, GSChu, DLForeman, JEEveleth, DDPowers, JC Novel peptidyl alpha-keto amide inhibitors of calpains and other cysteine proteases. J Med Chem 39:4089-98 (1996)  
Target
Name:
Cathepsin B
Synonyms:
BCSB CTSB Cathepsin B1
Type:
Enzyme
Mol. Mass.:
36657.87
Organism:
Bos taurus (bovine)
Description:
Bovine spleen CB was purchased from Sigma Co. (USA).
Residue:
335
  
Inhibitor
Name:
BDBM50053851
Synonyms:
(3-Methyl-1-{1-[3-(3,4,4a,8a-tetrahydro-2H-quinolin-1-yl)-propylaminooxalyl]-propylcarbamoyl}-butyl)-carbamic acid benzyl ester | CHEMBL337635
Type:
Small organic molecule
Emp. Form.:
C31H44N4O5
Mol. Mass.:
552.7049
SMILES:
CCC(NC(=O)C(CC(C)C)NC(=O)OCc1ccccc1)C(=O)C(=O)NCCCN1CCCC2C=CC=CC12
: