Target
Cathepsin B
Ligand
BDBM50053866
Substrate
Meas. Tech.
ChEMBL_47385 (CHEMBL659000)
Ki
96.0±n/a nM
Citation
 Li, ZOrtega-Vilain, ACPatil, GSChu, DLForeman, JEEveleth, DDPowers, JC Novel peptidyl alpha-keto amide inhibitors of calpains and other cysteine proteases. J Med Chem 39:4089-98 (1996)  
Target
Name:
Cathepsin B
Synonyms:
BCSB CTSB Cathepsin B1
Type:
Enzyme
Mol. Mass.:
36657.87
Organism:
Bos taurus (bovine)
Description:
Bovine spleen CB was purchased from Sigma Co. (USA).
Residue:
335
  
Inhibitor
Name:
BDBM50053866
Synonyms:
CHEMBL131707 | Quinoline-2-carboxylic acid [1-(1-ethylaminooxalyl-propylcarbamoyl)-3-methyl-butyl]-amide
Type:
Small organic molecule
Emp. Form.:
C23H30N4O4
Mol. Mass.:
426.5087
SMILES:
CCNC(=O)C(=O)C(CC)NC(=O)C(CC(C)C)NC(=O)c1ccc2ccccc2n1
: