Target
Calpain-1 catalytic subunit
Ligand
BDBM50053868
Substrate
Meas. Tech.
ChEMBL_43668 (CHEMBL656201)
Ki
120±n/a nM
Citation
 Li, ZOrtega-Vilain, ACPatil, GSChu, DLForeman, JEEveleth, DDPowers, JC Novel peptidyl alpha-keto amide inhibitors of calpains and other cysteine proteases. J Med Chem 39:4089-98 (1996)  
Target
Name:
Calpain-1 catalytic subunit
Synonyms:
CAN1_HUMAN CAPN1 Calpain-1 (u-Calpain) Calpain1
Type:
Protein
Mol. Mass.:
81880.51
Organism:
Homo sapiens (Human)
Description:
Residue:
714
  
Inhibitor
Name:
BDBM50053868
Synonyms:
CHEMBL335291 | {1-[1-Benzyl-2-(3-morpholin-4-yl-propylcarbamoyl)-2-oxo-ethylcarbamoyl]-3-methyl-butyl}-carbamic acid benzyl ester
Type:
Small organic molecule
Emp. Form.:
C31H42N4O6
Mol. Mass.:
566.6884
SMILES:
CC(C)CC(NC(=O)OCc1ccccc1)C(=O)NC(Cc1ccccc1)C(=O)C(=O)NCCCN1CCOCC1
: