Target
Cathepsin B
Ligand
BDBM50042419
Substrate
Meas. Tech.
ChEMBL_47427 (CHEMBL662614)
Ki
3000±n/a nM
Citation
 Li, ZOrtega-Vilain, ACPatil, GSChu, DLForeman, JEEveleth, DDPowers, JC Novel peptidyl alpha-keto amide inhibitors of calpains and other cysteine proteases. J Med Chem 39:4089-98 (1996)  
Target
Name:
Cathepsin B
Synonyms:
APP secretase CATB_HUMAN CTSB Cathepsin B light chain | Cathepsin B1
Type:
Enzyme
Mol. Mass.:
37819.69
Organism:
Homo sapiens (Human)
Description:
gi_63102437
Residue:
339
  
Inhibitor
Name:
BDBM50042419
Synonyms:
CHEMBL116477 | [1-(1-Benzyl-2-oxo-2-propylcarbamoyl-ethylcarbamoyl)-3-methyl-butyl]-carbamic acid benzyl ester
Type:
Small organic molecule
Emp. Form.:
C27H35N3O5
Mol. Mass.:
481.5839
SMILES:
CCCNC(=O)C(=O)C(Cc1ccccc1)NC(=O)C(CC(C)C)NC(=O)OCc1ccccc1
: