Target
Cathepsin B
Ligand
BDBM50042411
Substrate
Meas. Tech.
ChEMBL_44955 (CHEMBL661081)
Ki
9300±n/a nM
Citation
 Li, ZOrtega-Vilain, ACPatil, GSChu, DLForeman, JEEveleth, DDPowers, JC Novel peptidyl alpha-keto amide inhibitors of calpains and other cysteine proteases. J Med Chem 39:4089-98 (1996)  
Target
Name:
Cathepsin B
Synonyms:
APP secretase CATB_HUMAN CTSB Cathepsin B light chain | Cathepsin B1
Type:
Enzyme
Mol. Mass.:
37819.69
Organism:
Homo sapiens (Human)
Description:
gi_63102437
Residue:
339
  
Inhibitor
Name:
BDBM50042411
Synonyms:
CHEMBL331850 | [1-(1-Benzyl-2-oxo-2-phenethylcarbamoyl-ethylcarbamoyl)-3-methyl-butyl]-carbamic acid benzyl ester
Type:
Small organic molecule
Emp. Form.:
C32H37N3O5
Mol. Mass.:
543.6533
SMILES:
CC(C)CC(NC(=O)OCc1ccccc1)C(=O)NC(Cc1ccccc1)C(=O)C(=O)NCCc1ccccc1
: