Target
Voltage-dependent L-type calcium channel subunit alpha-1S
Ligand
BDBM50053875
Substrate
Meas. Tech.
ChEMBL_92776 (CHEMBL700076)
Ki
170±n/a nM
Citation
 Dhainaut, ARegnier, GTizot, APierre, ALeonce, SGuilbaud, NKraus-Berthier, LAtassi, G New purines and purine analogs as modulators of multidrug resistance. J Med Chem 39:4099-108 (1996)  
Target
Name:
Voltage-dependent L-type calcium channel subunit alpha-1S
Synonyms:
CAC1S_RAT Cacn1 Cacnl1a3 Cchl1a3 Voltage-gated L-type calcium channel Voltage-gated calcium channel subunit alpha Cav1.1
Type:
PROTEIN
Mol. Mass.:
210392.58
Organism:
Rattus norvegicus
Description:
ChEMBL_92777
Residue:
1850
  
Inhibitor
Name:
BDBM50053875
Synonyms:
Allyl-(9-allyl-2-{4-[(5H-dibenzo[a,d]cyclohepten-5-ylmethyl)-amino]-piperidin-1-yl}-9H-purin-6-yl)-amine | CHEMBL132565
Type:
Small organic molecule
Emp. Form.:
C32H35N7
Mol. Mass.:
517.6672
SMILES:
C=CCNc1nc(nc2n(CC=C)cnc12)N1CCC(CC1)NCC1c2ccccc2C=Cc2ccccc12
: