Target
Voltage-dependent L-type calcium channel subunit alpha-1S
Ligand
BDBM50053895
Substrate
Meas. Tech.
ChEMBL_92776 (CHEMBL700076)
Ki
99±n/a nM
Citation
 Dhainaut, ARegnier, GTizot, APierre, ALeonce, SGuilbaud, NKraus-Berthier, LAtassi, G New purines and purine analogs as modulators of multidrug resistance. J Med Chem 39:4099-108 (1996)  
Target
Name:
Voltage-dependent L-type calcium channel subunit alpha-1S
Synonyms:
CAC1S_RAT Cacn1 Cacnl1a3 Cchl1a3 Voltage-gated L-type calcium channel Voltage-gated calcium channel subunit alpha Cav1.1
Type:
PROTEIN
Mol. Mass.:
210392.58
Organism:
Rattus norvegicus
Description:
ChEMBL_92777
Residue:
1850
  
Inhibitor
Name:
BDBM50053895
Synonyms:
Allyl-(9-allyl-2-{4-[(2,3,4-trimethoxy-10,11-dihydro-5H-dibenzo[a,d]cyclohepten-5-ylmethyl)-amino]-piperidin-1-yl}-9H-purin-6-yl)-amine | CHEMBL336560
Type:
Small organic molecule
Emp. Form.:
C35H43N7O3
Mol. Mass.:
609.761
SMILES:
COc1cc2CCc3ccccc3C(CNC3CCN(CC3)c3nc(NCC=C)c4ncn(CC=C)c4n3)c2c(OC)c1OC
: