Target
Bromodomain-containing protein 4
Ligand
BDBM50099339
Substrate
Meas. Tech.
ChEMBL_1810623 (CHEMBL4310083)
IC50
>250000±n/a nM
Citation
 Divakaran, ATalluri, SKAyoub, AMMishra, NKCui, HWiden, JCBerndt, NZhu, JYCarlson, ASTopczewski, JJSchonbrunn, EKHarki, DAPomerantz, WCK Molecular Basis for the N-Terminal Bromodomain-and-Extra-Terminal-Family Selectivity of a Dual Kinase-Bromodomain Inhibitor. J Med Chem 61:9316-9334 (2018)  
Target
Name:
Bromodomain-containing protein 4
Synonyms:
BRD4 Bromodomain-containing protein 4 (BRD4) Protein HUNK1
Type:
Protein
Mol. Mass.:
152264.84
Organism:
Homo sapiens (Human)
Description:
O60885
Residue:
1362
  
Inhibitor
Name:
BDBM50099339
Synonyms:
2-(3,5-Difluoro-phenoxy)-4-[5-(4-fluoro-phenyl)-3-piperidin-4-yl-3H-imidazol-4-yl]-pyrimidine | CHEMBL14339
Type:
Small organic molecule
Emp. Form.:
C24H20F3N5O
Mol. Mass.:
451.4437
SMILES:
Fc1ccc(cc1)-c1ncn(C2CCNCC2)c1-c1ccnc(Oc2cc(F)cc(F)c2)n1
: