Target
Bromodomain testis-specific protein
Ligand
BDBM50099339
Substrate
Meas. Tech.
ChEMBL_1810627 (CHEMBL4310087)
IC50
>250000±n/a nM
Citation
 Divakaran, ATalluri, SKAyoub, AMMishra, NKCui, HWiden, JCBerndt, NZhu, JYCarlson, ASTopczewski, JJSchonbrunn, EKHarki, DAPomerantz, WCK Molecular Basis for the N-Terminal Bromodomain-and-Extra-Terminal-Family Selectivity of a Dual Kinase-Bromodomain Inhibitor. J Med Chem 61:9316-9334 (2018)  
Target
Name:
Bromodomain testis-specific protein
Synonyms:
BRDT Bromodomain and extra-terminal motif (BET) Cancer/testis antigen 9 | RING3-like protein
Type:
PROTEIN
Mol. Mass.:
107982.01
Organism:
Homo sapiens (Human)
Description:
ChEMBL_1502985
Residue:
947
  
Inhibitor
Name:
BDBM50099339
Synonyms:
2-(3,5-Difluoro-phenoxy)-4-[5-(4-fluoro-phenyl)-3-piperidin-4-yl-3H-imidazol-4-yl]-pyrimidine | CHEMBL14339
Type:
Small organic molecule
Emp. Form.:
C24H20F3N5O
Mol. Mass.:
451.4437
SMILES:
Fc1ccc(cc1)-c1ncn(C2CCNCC2)c1-c1ccnc(Oc2cc(F)cc(F)c2)n1
: