Target
Adenosine receptor A1
Ligand
BDBM50053922
Substrate
Meas. Tech.
ChEMBL_29304 (CHEMBL640365)
Ki
283±n/a nM
Citation
 Kim, YCJi, XDJacobson, KA Derivatives of the triazoloquinazoline adenosine antagonist (CGS15943) are selective for the human A3 receptor subtype. J Med Chem 39:4142-8 (1996)  
Target
Name:
Adenosine receptor A1
Synonyms:
AA1R_RAT ADENOSINE A1 high Adenosine A1 receptor (A1) Adenosine receptors A1 | Adora1
Type:
Protein
Mol. Mass.:
36704.13
Organism:
Rattus norvegicus (rat)
Description:
Residue:
326
  
Inhibitor
Name:
BDBM50053922
Synonyms:
CHEMBL329722 N-(9-chloro-2-(furan-2-yl)-[1,2,4]triazolo[1,5-c]quinazolin-5-yl)propionamide
Type:
Small organic molecule
Emp. Form.:
C16H12ClN5O2
Mol. Mass.:
341.752
SMILES:
CCC(=O)Nc1nc2ccc(Cl)cc2c2nc(nn12)-c1ccco1
: