Target
Adenosine receptor A1
Ligand
BDBM50053930
Substrate
Meas. Tech.
ChEMBL_29304 (CHEMBL640365)
Ki
32.5±n/a nM
Citation
 Kim, YCJi, XDJacobson, KA Derivatives of the triazoloquinazoline adenosine antagonist (CGS15943) are selective for the human A3 receptor subtype. J Med Chem 39:4142-8 (1996)  
Target
Name:
Adenosine receptor A1
Synonyms:
AA1R_RAT ADENOSINE A1 high Adenosine A1 receptor (A1) Adenosine receptors A1 | Adora1
Type:
Protein
Mol. Mass.:
36704.13
Organism:
Rattus norvegicus (rat)
Description:
Residue:
326
  
Inhibitor
Name:
BDBM50053930
Synonyms:
CHEMBL319971 | N-(9-Chloro-2-furan-2-yl-[1,2,4]triazolo[1,5-c]quinazolin-5-yl)-butyramide
Type:
Small organic molecule
Emp. Form.:
C17H14ClN5O2
Mol. Mass.:
355.778
SMILES:
CCCC(=O)Nc1nc2ccc(Cl)cc2c2nc(nn12)-c1ccco1
: