Target
Adenosine receptor A2a
Ligand
BDBM50053926
Substrate
Meas. Tech.
ChEMBL_30925 (CHEMBL647735)
Ki
48.8±n/a nM
Citation
 Kim, YCJi, XDJacobson, KA Derivatives of the triazoloquinazoline adenosine antagonist (CGS15943) are selective for the human A3 receptor subtype. J Med Chem 39:4142-8 (1996)  
Target
Name:
Adenosine receptor A2a
Synonyms:
AA2AR_RAT Adenosine A2 receptor Adenosine Receptors A2a (A2a) Adenosine receptors A2a Rat striatal adenosine A2a receptor
Type:
G Protein-Coupled Receptor (GPCR)
Mol. Mass.:
45015.65
Organism:
Rattus norvegicus (rat)
Description:
Rat A2A receptors expressed in CHO cells.
Residue:
410
  
Inhibitor
Name:
BDBM50053926
Synonyms:
CHEMBL313422 | Pentanoic acid (9-chloro-2-furan-2-yl-[1,2,4]triazolo[1,5-c]quinazolin-5-yl)-amide
Type:
Small organic molecule
Emp. Form.:
C18H16ClN5O2
Mol. Mass.:
369.805
SMILES:
CCCCC(=O)Nc1nc2ccc(Cl)cc2c2nc(nn12)-c1ccco1
: