Target
Inosine-5'-monophosphate dehydrogenase 2
Ligand
BDBM50054037
Substrate
Meas. Tech.
ChEMBL_89809 (CHEMBL697547)
IC50
>100000±n/a nM
Citation
 Nelson, PHCarr, SFDevens, BHEugui, EMFranco, FGonzalez, CHawley, RCLoughhead, DGMilan, DJPapp, EPatterson, JWRouhafza, SSjogren, EBSmith, DBStephenson, RATalamas, FXWaltos, AMWeikert, RJWu, JC Structure-activity relationships for inhibition of inosine monophosphate dehydrogenase by nuclear variants of mycophenolic acid. J Med Chem 39:4181-96 (1996)  
Target
Name:
Inosine-5'-monophosphate dehydrogenase 2
Synonyms:
IMDH2_HUMAN IMPD 2 IMPDH-II Inosine 5'-monophosphate dehydrogenase II (IMPDH II) Inosine-5 -monophosphate dehydrogenase 2 | Inosine-5'-monophosphate dehydrogenase (IMPDH)
Type:
Enzyme
Mol. Mass.:
55806.87
Organism:
Homo sapiens (Human)
Description:
Recombinant IMPDH2 expressed in E. coli.
Residue:
514
  
Inhibitor
Name:
BDBM50054037
Synonyms:
(E)-6-(6-Hydroxy-2,3,4-trimethyl-phenyl)-4-methyl-hex-4-enoic acid | CHEMBL133826
Type:
Small organic molecule
Emp. Form.:
C16H22O3
Mol. Mass.:
262.3441
SMILES:
C\C(CCC(O)=O)=C/Cc1c(O)cc(C)c(C)c1C
: