Target
Inosine-5'-monophosphate dehydrogenase 2
Ligand
BDBM50054046
Substrate
Meas. Tech.
ChEMBL_89810 (CHEMBL697548)
pH
8±n/a
IC50
6960±n/a nM
Comments
extracted
Citation
 Nelson, PHCarr, SFDevens, BHEugui, EMFranco, FGonzalez, CHawley, RCLoughhead, DGMilan, DJPapp, EPatterson, JWRouhafza, SSjogren, EBSmith, DBStephenson, RATalamas, FXWaltos, AMWeikert, RJWu, JC Structure-activity relationships for inhibition of inosine monophosphate dehydrogenase by nuclear variants of mycophenolic acid. J Med Chem 39:4181-96 (1996)  
Target
Name:
Inosine-5'-monophosphate dehydrogenase 2
Synonyms:
IMDH2_HUMAN IMPD 2 IMPDH-II Inosine 5'-monophosphate dehydrogenase II (IMPDH II) Inosine-5 -monophosphate dehydrogenase 2 | Inosine-5'-monophosphate dehydrogenase (IMPDH)
Type:
Enzyme
Mol. Mass.:
55806.87
Organism:
Homo sapiens (Human)
Description:
Recombinant IMPDH2 expressed in E. coli.
Residue:
514
  
Inhibitor
Name:
BDBM50054046
Synonyms:
(E)-6-(4-Hydroxy-7-methyl-3-oxo-1,3-dihydro-isobenzofuran-5-yl)-4-methyl-hex-4-enoic acid | CHEMBL131696
Type:
Small organic molecule
Emp. Form.:
C16H18O5
Mol. Mass.:
290.3111
SMILES:
C\C(CCC(O)=O)=C/Cc1cc(C)c2COC(=O)c2c1O
: