Target
Translocator protein
Ligand
BDBM50054131
Substrate
Meas. Tech.
ChEMBL_39466 (CHEMBL653041)
IC50
>1000±n/a nM
Citation
 Anzini, MCappelli, AVomero, SGiorgi, GLanger, TBruni, GRomeo, MRBasile, AS Molecular basis of peripheral vs central benzodiazepine receptor selectivity in a new class of peripheral benzodiazepine receptor ligands related to alpidem. J Med Chem 39:4275-84 (1996)  
Target
Name:
Translocator protein
Synonyms:
Benzodiazepine receptors; peripheral & central Mbr PBR Peripheral benzodiazepine receptor (PBR) TSPO_RAT | Tspo
Type:
Mitochondrion membrane protein
Mol. Mass.:
18945.84
Organism:
Rattus norvegicus (rat)
Description:
Competitive binding experiments were performed on rat kidney mitochondrial membranes.
Residue:
169
  
Inhibitor
Name:
BDBM50054131
Synonyms:
2-[2-(4-Chloro-phenyl)-1-oxo-2,3-dihydro-1H-pyrrolo[3,4-b]quinolin-3-yl]-N,N-dihexyl-acetamide | CHEMBL335049
Type:
Small organic molecule
Emp. Form.:
C31H38ClN3O2
Mol. Mass.:
520.105
SMILES:
CCCCCCN(CCCCCC)C(=O)Cc1n(-c2ccc(Cl)cc2)c(=O)c2cc3ccccc3[nH]c12
: