Target
Translocator protein
Ligand
BDBM50054137
Substrate
Meas. Tech.
ChEMBL_39466 (CHEMBL653041)
IC50
33000±n/a nM
Citation
 Anzini, MCappelli, AVomero, SGiorgi, GLanger, TBruni, GRomeo, MRBasile, AS Molecular basis of peripheral vs central benzodiazepine receptor selectivity in a new class of peripheral benzodiazepine receptor ligands related to alpidem. J Med Chem 39:4275-84 (1996)  
Target
Name:
Translocator protein
Synonyms:
Benzodiazepine receptors; peripheral & central Mbr PBR Peripheral benzodiazepine receptor (PBR) TSPO_RAT | Tspo
Type:
Mitochondrion membrane protein
Mol. Mass.:
18945.84
Organism:
Rattus norvegicus (rat)
Description:
Competitive binding experiments were performed on rat kidney mitochondrial membranes.
Residue:
169
  
Inhibitor
Name:
BDBM50054137
Synonyms:
2-[6-(4-Chloro-phenyl)-5-oxo-5,6-dihydro-pyrrolo[3,4-b]pyridin-(7E)-ylidene]-N,N-dihexyl-acetamide | CHEMBL137730
Type:
Small organic molecule
Emp. Form.:
C27H34ClN3O2
Mol. Mass.:
468.031
SMILES:
CCCCCCN(CCCCCC)C(=O)\C=C1\N(C(=O)c2cccnc12)c1ccc(Cl)cc1
: