Target
Translocator protein
Ligand
BDBM50054125
Substrate
Meas. Tech.
ChEMBL_39460 (CHEMBL653035)
IC50
14±n/a nM
Citation
 Anzini, MCappelli, AVomero, SGiorgi, GLanger, TBruni, GRomeo, MRBasile, AS Molecular basis of peripheral vs central benzodiazepine receptor selectivity in a new class of peripheral benzodiazepine receptor ligands related to alpidem. J Med Chem 39:4275-84 (1996)  
Target
Name:
Translocator protein
Synonyms:
Benzodiazepine receptors; peripheral & central Mbr PBR Peripheral benzodiazepine receptor (PBR) TSPO_RAT | Tspo
Type:
Mitochondrion membrane protein
Mol. Mass.:
18945.84
Organism:
Rattus norvegicus (rat)
Description:
Competitive binding experiments were performed on rat kidney mitochondrial membranes.
Residue:
169
  
Inhibitor
Name:
BDBM50054125
Synonyms:
(E)-2-(2-(4-chlorophenyl)-1,2-dihydro-1-oxo-3H-pyrrolo[3,4-b]quinolin-3-ylidene-N-(4-metoxyphenyl)-N-methylacetamide CHEMBL135870
Type:
Small organic molecule
Emp. Form.:
C27H20ClN3O3
Mol. Mass.:
469.919
SMILES:
COc1ccc(cc1)N(C)C(=O)\C=C1\N(C(=O)c2cc3ccccc3nc12)c1ccc(Cl)cc1
: