Target
Gag-Pol polyprotein [489-587]
Ligand
BDBM50054179
Substrate
Meas. Tech.
ChEMBL_160748 (CHEMBL769062)
Ki
0.02±n/a nM
Citation
 Wilkerson, WWAkamike, ECheatham, WWHollis, AYCollins, RDDeLucca, ILam, PYRu, Y HIV protease inhibitory bis-benzamide cyclic ureas: a quantitative structure-activity relationship analysis. J Med Chem 39:4299-312 (1996)  
Target
Name:
Gag-Pol polyprotein [489-587]
Synonyms:
Human immunodeficiency virus type 1 protease Pol polyprotein | gag-pol
Type:
Enzyme Subunit
Mol. Mass.:
10781.16
Organism:
Human immunodeficiency virus type 1
Description:
P04585[489-587]
Residue:
99
  
Inhibitor
Name:
BDBM50054179
Synonyms:
(4r,5r,6,7)-3,3-[[Tetrahydro-5,6-dihydroxy-2-oxo-4,7-bis(phenylmethyl)-1H-1,3-diazepine-1,3(2H)-diyl]bis-methylene)]bis[N-2-pyrazinylbenzamide] CHEMBL262642
Type:
Small organic molecule
Emp. Form.:
C43H40N8O5
Mol. Mass.:
748.8283
SMILES:
O[C@@H]1[C@@H](O)[C@@H](Cc2ccccc2)N(Cc2cccc(c2)C(=O)Nc2cnccn2)C(=O)N(Cc2cccc(c2)C(=O)Nc2cnccn2)[C@@H]1Cc1ccccc1
: