Target
Steroid 17-alpha-hydroxylase/17,20 lyase
Ligand
BDBM50054200
Substrate
Meas. Tech.
ChEMBL_50517 (CHEMBL661134)
IC50
35000±n/a nM
Citation
 Li, JSLi, YSon, CBrodie, AM Synthesis and evaluation of pregnane derivatives as inhibitors of human testicular 17 alpha-hydroxylase/C17,20-lyase. J Med Chem 39:4335-9 (1996)  
Target
Name:
Steroid 17-alpha-hydroxylase/17,20 lyase
Synonyms:
CP17A_HUMAN CYP17A1 Cytochrome P450 17A1 Cytochrome P450 C17 (CYP17) Cytochrome P450-C17 P450-C17 Steroid 17-alpha-Monooxygenase (CYP17) Steroid 17-alpha-monooxygenase | cytochrome P450 monooxygenase 17 alpha hydroxylase/17,20-lyase (CYP17)
Type:
Enzyme
Mol. Mass.:
57382.42
Organism:
Homo sapiens (Human)
Description:
E.coli expressing human CYP17
Residue:
508
  
Inhibitor
Name:
BDBM50054200
Synonyms:
(3S,10R,13S)-17-[1-(Dimethyl-hydrazono)-ethyl]-10,13-dimethyl-2,3,4,7,8,9,10,11,12,13,14,15-dodecahydro-1H-cyclopenta[a]phenanthren-3-ol | CHEMBL138170
Type:
Small organic molecule
Emp. Form.:
C23H36N2O
Mol. Mass.:
356.5447
SMILES:
CN(C)N=C(C)C1=CCC2C3CC=C4C[C@@H](O)CC[C@]4(C)C3CC[C@]12C
: