Target
Steroid 17-alpha-hydroxylase/17,20 lyase
Ligand
BDBM50054210
Substrate
Meas. Tech.
ChEMBL_50517 (CHEMBL661134)
IC50
10700±n/a nM
Citation
 Li, JSLi, YSon, CBrodie, AM Synthesis and evaluation of pregnane derivatives as inhibitors of human testicular 17 alpha-hydroxylase/C17,20-lyase. J Med Chem 39:4335-9 (1996)  
Target
Name:
Steroid 17-alpha-hydroxylase/17,20 lyase
Synonyms:
CP17A_HUMAN CYP17A1 Cytochrome P450 17A1 Cytochrome P450 C17 (CYP17) Cytochrome P450-C17 P450-C17 Steroid 17-alpha-Monooxygenase (CYP17) Steroid 17-alpha-monooxygenase | cytochrome P450 monooxygenase 17 alpha hydroxylase/17,20-lyase (CYP17)
Type:
Enzyme
Mol. Mass.:
57382.42
Organism:
Homo sapiens (Human)
Description:
E.coli expressing human CYP17
Residue:
508
  
Inhibitor
Name:
BDBM50054210
Synonyms:
(3S,10R,13S)-3-Hydroxy-10,13-dimethyl-1,2,3,4,7,8,9,10,11,12,13,14,15,16-tetradecahydro-cyclopenta[a]phenanthren-17-one oxime | CHEMBL344668
Type:
Small organic molecule
Emp. Form.:
C19H29NO2
Mol. Mass.:
303.4391
SMILES:
C[C@]12CCC3C(CC=C4C[C@@H](O)CC[C@]34C)C1CCC2N=O
: