Target
Folylpolyglutamate synthase, mitochondrial
Ligand
BDBM50054215
Substrate
Meas. Tech.
ChEMBL_68518 (CHEMBL676942)
IC50
>200000±n/a nM
Citation
 Mao, ZPan, JKalman, TI Design and synthesis of histidine analogues of folic acid and methotrexate as potential folylpolyglutamate synthetase inhibitors. J Med Chem 39:4340-4 (1996)  
Target
Name:
Folylpolyglutamate synthase, mitochondrial
Synonyms:
FOLC_HUMAN Folylpoly-gamma-glutamate synthetase Tetrahydrofolate synthase | Tetrahydrofolylpolyglutamate synthase
Type:
PROTEIN
Mol. Mass.:
64621.95
Organism:
Homo sapiens (Human)
Description:
ChEMBL_68676
Residue:
587
  
Inhibitor
Name:
BDBM50054215
Synonyms:
2-{4-[(2,4-Diamino-pteridin-6-ylmethyl)-methyl-amino]-benzoylamino}-3-(1H-imidazol-4-yl)-propionic acid | CHEMBL137366
Type:
Small organic molecule
Emp. Form.:
C21H22N10O3
Mol. Mass.:
462.4646
SMILES:
CN(Cc1cnc2nc(N)nc(N)c2n1)c1ccc(cc1)C(=O)NC(Cc1cnc[nH]1)C(O)=O
: