Target
Acyl-CoA:cholesterol acyltransferase
Ligand
BDBM50054302
Substrate
Meas. Tech.
ChEMBL_28664 (CHEMBL649062)
IC50
14±n/a nM
Citation
 White, ADCreswell, MWChucholowski, AWBlankley, CJWilson, MWBousley, RFEssenburg, ADHamelehle, KLKrause, BRStanfield, RLDominick, MANeub, M Heterocyclic ureas: inhibitors of acyl-CoA:cholesterol O-acyltransferase as hypocholesterolemic agents. J Med Chem 39:4382-95 (1996)  
Target
Name:
Acyl-CoA:cholesterol acyltransferase
Synonyms:
ACAT
Type:
Mol. Mass.:
35405.31
Organism:
Oryctolagus cuniculus
Description:
Residue:
305
  
Inhibitor
Name:
BDBM50054302
Synonyms:
1-(2,6-Diisopropyl-phenyl)-3-(2-dodecyl-2,3-dihydro-1H-tetrazol-5-yl)-urea | CHEMBL138229
Type:
Small organic molecule
Emp. Form.:
C26H46N6O
Mol. Mass.:
458.683
SMILES:
CCCCCCCCCCCCN1NN=C(NC(=O)Nc2c(cccc2C(C)C)C(C)C)N1
: