Target
5-hydroxytryptamine receptor 1A
Ligand
BDBM50001862
Substrate
Meas. Tech.
ChEMBL_1163 (CHEMBL616108)
Ki
68±n/a nM
Citation
 López-Rodríguez, MLRosado, MLBenhamú, BMorcillo, MJSanz, AMOrensanz, LBeneitez, MEFuentes, JAManzanares, J Synthesis and structure-activity relationships of a new model of arylpiperazines. 1. 2-[[4-(o-methoxyphenyl)piperazin-1-yl]methyl]-1, 3-dioxoperhydroimidazo[1,5-alpha]pyridine: a selective 5-HT1A receptor agonist. J Med Chem 39:4439-50 (1996)  
Target
Name:
5-hydroxytryptamine receptor 1A
Synonyms:
5-HT-1A 5-HT1A 5-hydroxytryptamine receptor 1A (5HT1A) 5ht1a Htr1a Serotonin 1a (5-HT1a) receptor/Adrenergic receptor alpha-1 | Serotonin receptor 1A
Type:
G Protein-Coupled Receptor (GPCR)
Mol. Mass.:
46445.29
Organism:
Rattus norvegicus (rat)
Description:
Binding assays were performed using rat hippocampal membranes.
Residue:
422
  
Inhibitor
Name:
BDBM50001862
Synonyms:
(N-(o-methoxyphenyl)piperazine)1-(2-Methoxy-phenyl)-piperazine 2-METHOXYPHENYLPIPERAZINE CHEMBL9666 | EN300-33366
Type:
Small organic molecule
Emp. Form.:
C11H16N2O
Mol. Mass.:
192.2575
SMILES:
COc1ccccc1N1CCNCC1
: