Target
Protein kinase C alpha type
Ligand
BDBM50054437
Substrate
Meas. Tech.
ChEMBL_162399 (CHEMBL769346)
IC50
>100000±n/a nM
Citation
 Pereira, ERBelin, LSancelme, MPrudhomme, MOllier, MRapp, MSevère, DRiou, JFFabbro, DMeyer, T Structure-activity relationships in a series of substituted indolocarbazoles: topoisomerase I and protein kinase C inhibition and antitumoral and antimicrobial properties. J Med Chem 39:4471-7 (1996)  
Target
Name:
Protein kinase C alpha type
Synonyms:
KPCA_HUMAN PKC alpha and beta-2 PKC-alpha PRKACA Protein Kinase C- alpha Protein kinase C alpha (PKCa) Protein kinase C alpha type (PRKCA) RAF proto-oncogene serine/threonine-protein kinase
Type:
Enzyme
Mol. Mass.:
76755.65
Organism:
Homo sapiens (Human)
Description:
The recombinant human PKC enzymes were produced using a baculovirus expression system in SF9 cells
Residue:
672
  
Inhibitor
Name:
BDBM50054437
Synonyms:
6-Amino-1,11-dichloro-12-(4-O-methyl-beta-D-glucopyranozyl) -6,7,12,13-tetrahydroindolo[2,3-a]pyrrolo[3,4-c]carbazole-5,7-dione | CHEMBL138757
Type:
Small organic molecule
Emp. Form.:
C27H22Cl2N4O7
Mol. Mass.:
585.392
SMILES:
COC1C(CO)OC(C(O)C1O)n1c2c(Cl)cccc2c2c3C(=O)N(N)C(=O)c3c3c4cccc(Cl)c4[nH]c3c12
: