Target
Protein Rev
Ligand
BDBM8580
Substrate
Meas. Tech.
ChEMBL_1811902 (CHEMBL4311362)
IC50
21000±n/a nM
Citation
 Simon, BWalmsley, CJackson, VJGarvey, EPSlater, MJBerrisford, DJGardiner, JM Evaluation of neomycin analogues for HIV-1 RRE RNA recognition identifies enhanced activity simplified neamine analogues. Bioorg Med Chem Lett 29:339-341 (2019)  
Target
Name:
Protein Rev
Synonyms:
Human immunodeficiency virus type 1 REV rev
Type:
PROTEIN
Mol. Mass.:
13078.11
Organism:
Human immunodeficiency virus 1
Description:
ChEMBL_79479
Residue:
116
  
Inhibitor
Name:
BDBM8580
Synonyms:
(2R,3S,4R,5R,6R)-5-amino-2-(aminomethyl)-6-{[(1R,2R,3S,4R,6S)-4,6-diamino-2,3-dihydroxycyclohexyl]oxy}oxane-3,4-diol | Neamine
Type:
Small organic molecule
Emp. Form.:
C12H26N4O6
Mol. Mass.:
322.358
SMILES:
NC[C@H]1O[C@H](O[C@@H]2[C@@H](N)C[C@@H](N)[C@H](O)[C@H]2O)[C@H](N)[C@@H](O)[C@@H]1O
: