Target
D(2) dopamine receptor
Ligand
BDBM50054761
Substrate
Meas. Tech.
ChEMBL_60229 (CHEMBL672798)
Ki
538±n/a nM
Citation
 Barf, TAde Boer, PWikström, HPeroutka, SJSwensson, KEnnis, MDGhazal, NBMcGuire, JCSmith, MW 5-HT1D receptor agonist properties of novel 2-[5-[[(trifluoromethyl)sulfonyl]oxy]indolyl]ethylamines and their use as synthetic intermediates. J Med Chem 39:4717-26 (1997)  
Target
Name:
D(2) dopamine receptor
Synonyms:
DOPAMINE D2 DOPAMINE D2 Short Dopamine D2 receptor Drd2
Type:
G Protein-Coupled Receptor (GPCR)
Mol. Mass.:
50931.60
Organism:
Rattus norvegicus (rat)
Description:
P61169
Residue:
444
  
Inhibitor
Name:
BDBM50054761
Synonyms:
CHEMBL143767 | Trifluoro-methanesulfonic acid 3-(2-dimethylamino-ethyl)-1H-indol-5-yl ester
Type:
Small organic molecule
Emp. Form.:
C13H15F3N2O3S
Mol. Mass.:
336.33
SMILES:
CN(C)CCc1c[nH]c2ccc(OS(=O)(=O)C(F)(F)F)cc12
: