Target
D(2) dopamine receptor
Ligand
BDBM50005835
Substrate
Meas. Tech.
ChEMBL_60229 (CHEMBL672798)
Ki
>218±n/a nM
Citation
 Barf, TAde Boer, PWikström, HPeroutka, SJSwensson, KEnnis, MDGhazal, NBMcGuire, JCSmith, MW 5-HT1D receptor agonist properties of novel 2-[5-[[(trifluoromethyl)sulfonyl]oxy]indolyl]ethylamines and their use as synthetic intermediates. J Med Chem 39:4717-26 (1997)  
Target
Name:
D(2) dopamine receptor
Synonyms:
DOPAMINE D2 DOPAMINE D2 Short Dopamine D2 receptor Drd2
Type:
G Protein-Coupled Receptor (GPCR)
Mol. Mass.:
50931.60
Organism:
Rattus norvegicus (rat)
Description:
P61169
Residue:
444
  
Inhibitor
Name:
BDBM50005835
Synonyms:
(3-[2-(dimethylamino)ethyl]-1H-indol-5-yl)-N-methylmethanesulfonamide 1-{3-[2-(dimethylamino)ethyl]-1H-indol-5-yl}-N-methylmethanesulfonamide 3-[2-(dimethylamino)ethyl]-N-methylindole-5-methanesulfonamide SUMATRIPTAN Sumax
Type:
Small organic molecule
Emp. Form.:
C14H21N3O2S
Mol. Mass.:
295.4
SMILES:
CNS(=O)(=O)Cc1ccc2[nH]cc(CCN(C)C)c2c1
: