Target
5-hydroxytryptamine receptor 1B
Ligand
BDBM50054762
Substrate
Meas. Tech.
ChEMBL_2033 (CHEMBL616867)
Ki
18±n/a nM
Citation
 Barf, TAde Boer, PWikström, HPeroutka, SJSwensson, KEnnis, MDGhazal, NBMcGuire, JCSmith, MW 5-HT1D receptor agonist properties of novel 2-[5-[[(trifluoromethyl)sulfonyl]oxy]indolyl]ethylamines and their use as synthetic intermediates. J Med Chem 39:4717-26 (1997)  
Target
Name:
5-hydroxytryptamine receptor 1B
Synonyms:
5-HT-1B 5-HT1B 5HT1B_HUMAN HTR1DB Serotonin (5-HT) receptor Serotonin Receptor 1B
Type:
G Protein-Coupled Receptor (GPCR)
Mol. Mass.:
43579.17
Organism:
Homo sapiens (Human)
Description:
Receptor binding assays were performed using human clone stably expressed in CHO cells
Residue:
390
  
Inhibitor
Name:
BDBM50054762
Synonyms:
CHEMBL143512 | Trifluoro-methanesulfonic acid 3-(2-amino-ethyl)-1H-indol-5-yl ester
Type:
Small organic molecule
Emp. Form.:
C11H11F3N2O3S
Mol. Mass.:
308.277
SMILES:
NCCc1c[nH]c2ccc(OS(=O)(=O)C(F)(F)F)cc12
: