Target
M-phase inducer phosphatase 3
Ligand
BDBM50504074
Substrate
Meas. Tech.
ChEMBL_1813328 (CHEMBL4312902)
Ki
1900±n/a nM
Citation
 Cerchia, CNasso, RMori, MVilla, SGelain, ACapasso, AAliotta, FSimonetti, MRullo, RMasullo, MDe Vendittis, ERuocco, MRLavecchia, A Discovery of Novel Naphthylphenylketone and Naphthylphenylamine Derivatives as Cell Division Cycle 25B (CDC25B) Phosphatase Inhibitors: Design, Synthesis, Inhibition Mechanism, and in Vitro Efficacy against Melanoma Cell Lines. J Med Chem 62:7089-7110 (2019)  
Target
Name:
M-phase inducer phosphatase 3
Synonyms:
CDC25C M-phase inducer phosphatase 3 | MPIP3_HUMAN
Type:
Substrate
Mol. Mass.:
53366.11
Organism:
Homo sapiens (Human)
Description:
P30307
Residue:
473
  
Inhibitor
Name:
BDBM50504074
Synonyms:
CHEMBL4447602
Type:
Small organic molecule
Emp. Form.:
C20H19NO3
Mol. Mass.:
321.3698
SMILES:
CCOC(=O)c1cccc(Nc2cc(OC)cc3ccccc23)c1
: