Target
Polyunsaturated fatty acid lipoxygenase ALOX15
Ligand
BDBM50054838
Substrate
Meas. Tech.
ChEMBL_208 (CHEMBL615242)
IC50
35±n/a nM
Citation
 Gorins, GKuhnert, LJohnson, CRMarnett, LJ (Carboxyalkyl)benzyl propargyl ethers as selective inhibitors of leukocyte-type 12-lipoxygenases. J Med Chem 39:4871-8 (1997)  
Target
Name:
Polyunsaturated fatty acid lipoxygenase ALOX15
Synonyms:
12-LOX 15-LOX Arachidonate 12-lipoxygenase Arachidonate omega-6 lipoxygenase LOX15_PIG
Type:
PROTEIN
Mol. Mass.:
74999.86
Organism:
Sus scrofa
Description:
ChEMBL_1510008
Residue:
663
  
Inhibitor
Name:
BDBM50054838
Synonyms:
3-(4-Tridec-2-ynyloxymethyl-phenyl)-propionic acid | CHEMBL144207
Type:
Small organic molecule
Emp. Form.:
C23H34O3
Mol. Mass.:
358.5143
SMILES:
CCCCCCCCCCC#CCOCc1ccc(CCC(O)=O)cc1
: