Target
Phospholipase A2, membrane associated
Ligand
BDBM50055315
Substrate
Meas. Tech.
ChEMBL_156192 (CHEMBL761443)
IC50
15±n/a nM
Citation
 Dillard, RDBach, NJDraheim, SEBerry, DRCarlson, DGChirgadze, NYClawson, DKHartley, LWJohnson, LMJones, NDMcKinney, ERMihelich, EDOlkowski, JLSchevitz, RWSmith, ACSnyder, DWSommers, CDWery, JP Indole inhibitors of human nonpancreatic secretory phospholipase A2. 2. Indole-3-acetamides with additional functionality. J Med Chem 39:5137-58 (1997)  
Target
Name:
Phospholipase A2, membrane associated
Synonyms:
GIIC sPLA2 NPS-PLA2 Non-pancreatic secretory phospholipase A2 (hnps-PLA2) PLA2B PLA2L Phospholipase A2 group IIA | RASF-A
Type:
Hydrolase
Mol. Mass.:
16101.20
Organism:
Homo sapiens (Human)
Description:
The human nps PLA2 was cloned, and expressed in E. coli. There was a refolding process in the purification.
Residue:
144
  
Inhibitor
Name:
BDBM50055315
Synonyms:
CHEMBL359304 | [3-(1-Benzyl-3-carbamoylmethyl-2-ethyl-6-methyl-1H-indol-5-yloxy)-propyl]-phosphonic acid
Type:
Small organic molecule
Emp. Form.:
C23H29N2O5P
Mol. Mass.:
444.4605
SMILES:
CCc1c(CC(N)=O)c2cc(OCCCP(O)(O)=O)c(C)cc2n1Cc1ccccc1
: