Target
Transcriptional activator protein LasR
Ligand
BDBM50465703
Substrate
Meas. Tech.
ChEMBL_1816423 (CHEMBL4315997)
IC50
50000±n/a nM
Citation
 Hossain, MASattenapally, NParikh, HILi, WRumbaugh, KPGerman, NA Design, synthesis, and evaluation of compounds capable of reducing Pseudomonas aeruginosa virulence. Eur J Med Chem 185:0 (2020)  
Target
Name:
Transcriptional activator protein LasR
Synonyms:
LASR_PSEAE | lasR
Type:
PROTEIN
Mol. Mass.:
26618.24
Organism:
Pseudomonas aeruginosa
Description:
ChEMBL_1475312
Residue:
239
  
Inhibitor
Name:
BDBM50465703
Synonyms:
CHEMBL1823945
Type:
Small organic molecule
Emp. Form.:
C20H14Cl2N2O2
Mol. Mass.:
385.243
SMILES:
Clc1cccc(c1)C(=O)Nc1ccccc1NC(=O)c1cccc(Cl)c1
: