Target
Protein kinase C epsilon type
Ligand
BDBM50055668
Substrate
Meas. Tech.
ChEMBL_160957 (CHEMBL769119)
IC50
10±n/a nM
Citation
 Lai, YSMendoza, JSJagdmann, GEMenaldino, DSBiggers, CKHeerding, JMWilson, JWHall, SEJiang, JBJanzen, WPBallas, LM Synthesis and protein kinase C inhibitory activities of balanol analogs with replacement of the perhydroazepine moiety. J Med Chem 40:226-35 (1997)  
Target
Name:
Protein kinase C epsilon type
Synonyms:
KPCE_HUMAN PKCE Protein kinase C epsilon Protein kinase C, PKC; classical/novel nPKC-epsilon
Type:
Enzyme
Mol. Mass.:
83680.45
Organism:
Homo sapiens (Human)
Description:
The recombinant human PKC enzymes were produced using a baculovirus expression system in SF9 cells
Residue:
737
  
Inhibitor
Name:
BDBM50055668
Synonyms:
4-(2-Carboxy-6-hydroxy-benzoyl)-3,5-dihydroxy-benzoic acid (1R,2R,4R)-4-amino-2-(4-hydroxy-benzoylamino)-cyclopentyl ester | CHEMBL432168
Type:
Small organic molecule
Emp. Form.:
C27H24N2O10
Mol. Mass.:
536.4869
SMILES:
N[C@@H]1C[C@@H](NC(=O)c2ccc(O)cc2)[C@@H](C1)OC(=O)c1cc(O)c(C(=O)c2c(O)cccc2C(O)=O)c(O)c1
: